Issue 11635

Title
Missing company context for coupon parties
Priority
bug
Status
resolved
Nosy list
albertca, ced, reviewbot, roundup-bot
Assigned to
ced
Keywords
review

Created on 2022-08-05.12:53:17 by albertca, last changed 4 days ago by roundup-bot.

Messages

New changeset 2e170efedbff by Cédric Krier in branch 'default':
Add company context to coupon parties field
https://hg.tryton.org/tryton-env/rev/2e170efedbff
New changeset 45796e158da7 by Cédric Krier in branch 'default':
Add company context to coupon parties field
https://hg.tryton.org/modules/sale_promotion_coupon/rev/45796e158da7
Author: [hidden] (albertca)
Date: 2022-08-05.12:53:16

Test of web_shop_vue_storefront is failing.

It seems it may be since: https://hg.tryton.org/modules/sale_promotion_coupon/rev/7a20a31b7662

FAIL: test_company_multivalue_context (test_module.WebVueStorefrontTestCase)
Test context of company multivalue target
----------------------------------------------------------------------
Traceback (most recent call last):
  File "/tryton/trytond/trytond/tests/test_tryton.py", line 209, in wrapper
    result = func(*args, **kwargs)
  File "/tryton/trytond/trytond/modules/company/tests/test_module.py", line 94, in test_company_multivalue_context
    self.assertIn(
AssertionError: 'company' not found in [] : Missing 'company' value as company in "sale.sale"."coupon_parties" context

----------------------------------------------------------------------
Ran 57 tests in 71.872s

FAILED (failures=1)
History
Date User Action Args
2022-08-08 22:24:11roundup-botsetmessages: + msg77644
2022-08-08 22:24:05roundup-botsetmessages: + msg77643
nosy: + roundup-bot
status: testing -> resolved
2022-08-05 15:24:47reviewbotsetmessages: + msg77600
nosy: + reviewbot
2022-08-05 15:22:04cedsetkeyword: + review
reviews: 439351003
status: in-progress -> testing
2022-08-05 15:21:05cedsetassignedto: ced
component: + sale_promotion_coupon, - web_shop_vue_storefront
nosy: + ced
status: unread -> in-progress
title: Test failure since issue11385 -> Missing company context for coupon parties
type: crash -> behavior
2022-08-05 12:53:17albertcacreate

Showing 10 items. Show all history (warning: this could be VERY long)